Build fail.

zniter81's Avatar

zniter81

24 Dec, 2018 09:18 AM

hi

i keep getting this error.
can help

Build started 12/24/2018 8:11:52 AM.
     1>Project "D:\temp\rfupqfga.0nq\input\PenYourPrayerServer.sln" on node 1 (default targets).
     1>ValidateSolutionConfiguration:
         Building solution configuration "Release|Any CPU".
     1>Project "D:\temp\rfupqfga.0nq\input\PenYourPrayerServer.sln" (1) is building "D:\temp\rfupqfga.0nq\input\PenYourPrayerServer\PenYourPrayerServer.csproj" (2) on node 1 (default targets).
     2>PrepareForBuild:
         Creating directory "obj\Release\".
       CoreCompile:
         C:\Program Files (x86)\Microsoft Visual Studio\2017\BuildTools\MSBuild\15.0\Bin\Roslyn\csc.exe /noconfig /nowarn:1701,1702 /nostdlib+ /errorreport:prompt /warn:4 /define:TRACE /highentropyva+ /reference:D:\temp\rfupqfga.0nq\input\packages\Antlr.3.4.1.9004\lib\Antlr3.Runtime.dll /reference:D:\temp\rfupqfga.0nq\input\PenYourPrayerServer\lib\EASendMail45.dll /reference:"C:\Program Files (x86)\Reference Assemblies\Microsoft\Framework\.NETFramework\v4.5\Microsoft.CSharp.dll" /reference:D:\temp\rfupqfga.0nq\input\packages\Microsoft.Web.Infrastructure.1.0.0.0\lib\net40\Microsoft.Web.Infrastructure.dll /reference:"C:\Program Files (x86)\Reference Assemblies\Microsoft\Framework\.NETFramework\v4.5\mscorlib.dll" /reference:D:\temp\rfupqfga.0nq\input\packages\Newtonsoft.Json.6.0.4\lib\net45\Newtonsoft.Json.dll /reference:D:\temp\rfupqfga.0nq\input\packages\Owin.1.0\lib\net40\Owin.dll /reference:"C:\Program Files (x86)\Reference Assemblies\Microsoft\Framework\.NETFramework\v4.5\System.ComponentModel.DataAnnotations.dll" /reference:"C:\Program Files (x86)\Reference Assemblies\Microsoft\Framework\.NETFramework\v4.5\System.Configuration.dll" /reference:"C:\Program Files (x86)\Reference Assemblies\Microsoft\Framework\.NETFramework\v4.5\System.Core.dll" /reference:"C:\Program Files (x86)\Reference Assemblies\Microsoft\Framework\.NETFramework\v4.5\System.Data.DataSetExtensions.dll" /reference:"C:\Program Files (x86)\Reference Assemblies\Microsoft\Framework\.NETFramework\v4.5\System.Data.dll" /reference:"C:\Program Files (x86)\Reference Assemblies\Microsoft\Framework\.NETFramework\v4.5\System.Data.Linq.dll" /reference:"C:\Program Files (x86)\Reference Assemblies\Microsoft\Framework\.NETFramework\v4.5\System.dll" /reference:"C:\Program Files (x86)\Reference Assemblies\Microsoft\Framework\.NETFramework\v4.5\System.Drawing.dll" /reference:"C:\Program Files (x86)\Reference Assemblies\Microsoft\Framework\.NETFramework\v4.5\System.EnterpriseServices.dll" /reference:"C:\Program Files (x86)\Reference Assemblies\Microsoft\Framework\.NETFramework\v4.5\System.Net.Http.dll" /reference:D:\temp\rfupqfga.0nq\input\packages\Microsoft.AspNet.WebApi.Client.5.2.3\lib\net45\System.Net.Http.Formatting.dll /reference:"C:\Program Files (x86)\Reference Assemblies\Microsoft\Framework\.NETFramework\v4.5\System.Web.ApplicationServices.dll" /reference:"C:\Program Files (x86)\Reference Assemblies\Microsoft\Framework\.NETFramework\v4.5\System.Web.dll" /reference:"C:\Program Files (x86)\Reference Assemblies\Microsoft\Framework\.NETFramework\v4.5\System.Web.DynamicData.dll" /reference:"C:\Program Files (x86)\Reference Assemblies\Microsoft\Framework\.NETFramework\v4.5\System.Web.Entity.dll" /reference:"C:\Program Files (x86)\Reference Assemblies\Microsoft\Framework\.NETFramework\v4.5\System.Web.Extensions.dll" /reference:D:\temp\rfupqfga.0nq\input\packages\Microsoft.AspNet.WebPages.3.2.3\lib\net45\System.Web.Helpers.dll /reference:D:\temp\rfupqfga.0nq\input\packages\Microsoft.AspNet.WebApi.Core.5.2.3\lib\net45\System.Web.Http.dll /reference:D:\temp\rfupqfga.0nq\input\packages\Microsoft.AspNet.WebApi.WebHost.5.2.3\lib\net45\System.Web.Http.WebHost.dll /reference:D:\temp\rfupqfga.0nq\input\packages\Microsoft.AspNet.Mvc.5.2.3\lib\net45\System.Web.Mvc.dll /reference:D:\temp\rfupqfga.0nq\input\packages\Microsoft.AspNet.Web.Optimization.1.1.3\lib\net40\System.Web.Optimization.dll /reference:D:\temp\rfupqfga.0nq\input\packages\Microsoft.AspNet.Razor.3.2.3\lib\net45\System.Web.Razor.dll /reference:"C:\Program Files (x86)\Reference Assemblies\Microsoft\Framework\.NETFramework\v4.5\System.Web.Services.dll" /reference:D:\temp\rfupqfga.0nq\input\packages\Microsoft.AspNet.WebPages.3.2.3\lib\net45\System.Web.WebPages.Deployment.dll /reference:D:\temp\rfupqfga.0nq\input\packages\Microsoft.AspNet.WebPages.3.2.3\lib\net45\System.Web.WebPages.dll /reference:D:\temp\rfupqfga.0nq\input\packages\Microsoft.AspNet.WebPages.3.2.3\lib\net45\System.Web.WebPages.Razor.dll /reference:"C:\Program Files (x86)\Reference Assemblies\Microsoft\Framework\.NETFramework\v4.5\System.Xml.dll" /reference:"C:\Program Files (x86)\Reference Assemblies\Microsoft\Framework\.NETFramework\v4.5\System.Xml.Linq.dll" /reference:D:\temp\rfupqfga.0nq\input\packages\WebGrease.1.5.2\lib\WebGrease.dll /debug:pdbonly /optimize+ /out:obj\Release\PenYourPrayerServer.dll /subsystemversion:6.00 /target:library /utf8output App_Start\BundleConfig.cs App_Start\FilterConfig.cs App_Start\RouteConfig.cs App_Start\Startup.Auth.cs App_Start\WebApiConfig.cs Controllers\AccountController.cs Controllers\FriendsController.cs Controllers\AttachmentController.cs Controllers\HomeController.cs Controllers\PrayerController.cs Controllers\UserAccountController.cs Global.asax.cs Models\Struct\PrayerAmen.cs Models\Struct\PrayerCommentReply.cs Models\Struct\PrayerRequestAttachment.cs Models\Struct\PrayerRequest.cs Models\Struct\PrayerAnswered.cs Models\Struct\PrayerComment.cs Models\Struct\PrayerAttachment.cs Models\Struct\Friends.cs Models\Struct\Prayer.cs Supporting\CommonMethod.cs Supporting\HMAC\HMACAuthorizeAttribute.cs Models\DB.designer.cs Models\Struct\CustomResponseMessage.cs Models\Struct\PenYourPrayerUser.cs Properties\AssemblyInfo.cs Supporting\CustomPasswordHasher.cs Supporting\HMAC\PenYourPrayerIdentity.cs Supporting\QuickReference.cs Supporting\SocialMediaAuthentication.cs Views\Home\index.aspx.cs Views\Home\index.aspx.designer.cs "D:\temp\rfupqfga.0nq\temp\.NETFramework,Version=v4.5.AssemblyAttributes.cs"
         Using shared compilation with compiler from directory: C:\Program Files (x86)\Microsoft Visual Studio\2017\BuildTools\MSBuild\15.0\Bin\Roslyn
     1>Project "D:\temp\rfupqfga.0nq\input\PenYourPrayerServer.sln" (1) is building "D:\temp\rfupqfga.0nq\input\Database1\Database1.sqlproj" (3) on node 2 (default targets).
     3>PrepareForBuild:
         Creating directory "obj\Release\".
       CoreCompile:
         C:\Program Files (x86)\Microsoft Visual Studio\2017\BuildTools\MSBuild\15.0\Bin\Roslyn\csc.exe /noconfig /nowarn:1701,1702 /nostdlib+ /errorreport:prompt /warn:4 /define:TRACE /highentropyva+ /reference:"C:\Program Files (x86)\Reference Assemblies\Microsoft\Framework\.NETFramework\v4.5\mscorlib.dll" /debug:pdbonly /optimize+ /out:obj\Release\Database1.dll /subsystemversion:6.00 /target:library /warnaserror- /utf8output "D:\temp\rfupqfga.0nq\temp\.NETFramework,Version=v4.5.SqlClrAttributes.cs"
         Using shared compilation with compiler from directory: C:\Program Files (x86)\Microsoft Visual Studio\2017\BuildTools\MSBuild\15.0\Bin\Roslyn
       SqlBuild:
         Creating a model to represent the project...
     3>Done Building Project "D:\temp\rfupqfga.0nq\input\Database1\Database1.sqlproj" (default targets) -- FAILED.
     2>Supporting\SocialMediaAuthentication.cs(59,34): warning CS0168: The variable 'e' is declared but never used [D:\temp\rfupqfga.0nq\input\PenYourPrayerServer\PenYourPrayerServer.csproj]
     2>Supporting\SocialMediaAuthentication.cs(77,30): warning CS0168: The variable 'e' is declared but never used [D:\temp\rfupqfga.0nq\input\PenYourPrayerServer\PenYourPrayerServer.csproj]
     2>Supporting\SocialMediaAuthentication.cs(152,30): warning CS0168: The variable 'ex' is declared but never used [D:\temp\rfupqfga.0nq\input\PenYourPrayerServer\PenYourPrayerServer.csproj]
     2>Supporting\HMAC\HMACAuthorizeAttribute.cs(59,17): warning CS0162: Unreachable code detected [D:\temp\rfupqfga.0nq\input\PenYourPrayerServer\PenYourPrayerServer.csproj]
     2>Supporting\HMAC\HMACAuthorizeAttribute.cs(206,34): warning CS0168: The variable 'e' is declared but never used [D:\temp\rfupqfga.0nq\input\PenYourPrayerServer\PenYourPrayerServer.csproj]
     2>Controllers\UserAccountController.cs(66,17): warning CS4014: Because this call is not awaited, execution of the current method continues before the call is completed. Consider applying the 'await' operator to the result of the call. [D:\temp\rfupqfga.0nq\input\PenYourPrayerServer\PenYourPrayerServer.csproj]
     2>Controllers\UserAccountController.cs(80,21): warning CS4014: Because this call is not awaited, execution of the current method continues before the call is completed. Consider applying the 'await' operator to the result of the call. [D:\temp\rfupqfga.0nq\input\PenYourPrayerServer\PenYourPrayerServer.csproj]
     2>Controllers\UserAccountController.cs(103,21): warning CS4014: Because this call is not awaited, execution of the current method continues before the call is completed. Consider applying the 'await' operator to the result of the call. [D:\temp\rfupqfga.0nq\input\PenYourPrayerServer\PenYourPrayerServer.csproj]
     2>Controllers\PrayerController.cs(83,24): warning CS0219: The variable 'res' is assigned but its value is never used [D:\temp\rfupqfga.0nq\input\PenYourPrayerServer\PenYourPrayerServer.csproj]
     2>Controllers\PrayerController.cs(160,24): warning CS0219: The variable 'res' is assigned but its value is never used [D:\temp\rfupqfga.0nq\input\PenYourPrayerServer\PenYourPrayerServer.csproj]
     2>Controllers\AccountController.cs(23,13): warning CS0162: Unreachable code detected [D:\temp\rfupqfga.0nq\input\PenYourPrayerServer\PenYourPrayerServer.csproj]
     2>Controllers\PrayerController.cs(236,24): warning CS0219: The variable 'res' is assigned but its value is never used [D:\temp\rfupqfga.0nq\input\PenYourPrayerServer\PenYourPrayerServer.csproj]
     2>Controllers\PrayerController.cs(313,24): warning CS0219: The variable 'res' is assigned but its value is never used [D:\temp\rfupqfga.0nq\input\PenYourPrayerServer\PenYourPrayerServer.csproj]
     2>Controllers\PrayerController.cs(390,24): warning CS0219: The variable 'res' is assigned but its value is never used [D:\temp\rfupqfga.0nq\input\PenYourPrayerServer\PenYourPrayerServer.csproj]
     2>Controllers\PrayerController.cs(539,34): warning CS0168: The variable 'e' is declared but never used [D:\temp\rfupqfga.0nq\input\PenYourPrayerServer\PenYourPrayerServer.csproj]
     2>Controllers\PrayerController.cs(588,34): warning CS0168: The variable 'e' is declared but never used [D:\temp\rfupqfga.0nq\input\PenYourPrayerServer\PenYourPrayerServer.csproj]
     2>Controllers\PrayerController.cs(627,23): warning CS0219: The variable 'AmenID' is assigned but its value is never used [D:\temp\rfupqfga.0nq\input\PenYourPrayerServer\PenYourPrayerServer.csproj]
     2>Controllers\PrayerController.cs(628,24): warning CS0219: The variable 'res' is assigned but its value is never used [D:\temp\rfupqfga.0nq\input\PenYourPrayerServer\PenYourPrayerServer.csproj]
     2>Controllers\PrayerController.cs(676,34): warning CS0168: The variable 'e' is declared but never used [D:\temp\rfupqfga.0nq\input\PenYourPrayerServer\PenYourPrayerServer.csproj]
     2>Controllers\PrayerController.cs(807,34): warning CS0168: The variable 'e' is declared but never used [D:\temp\rfupqfga.0nq\input\PenYourPrayerServer\PenYourPrayerServer.csproj]
     2>Models\Struct\PrayerRequest.cs(35,17): warning CS0472: The result of the expression is always 'true' since a value of type 'long' is never equal to 'null' of type 'long?' [D:\temp\rfupqfga.0nq\input\PenYourPrayerServer\PenYourPrayerServer.csproj]
     2>_CopyFilesMarkedCopyLocal:
         Copying file from "D:\temp\rfupqfga.0nq\input\PenYourPrayerServer\lib\EASendMail45.dll" to "D:\temp\rfupqfga.0nq\output\EASendMail45.dll".
         Copying file from "D:\temp\rfupqfga.0nq\input\packages\Antlr.3.4.1.9004\lib\Antlr3.Runtime.dll" to "D:\temp\rfupqfga.0nq\output\Antlr3.Runtime.dll".
         Copying file from "D:\temp\rfupqfga.0nq\input\packages\Microsoft.Web.Infrastructure.1.0.0.0\lib\net40\Microsoft.Web.Infrastructure.dll" to "D:\temp\rfupqfga.0nq\output\Microsoft.Web.Infrastructure.dll".
         Copying file from "D:\temp\rfupqfga.0nq\input\packages\Owin.1.0\lib\net40\Owin.dll" to "D:\temp\rfupqfga.0nq\output\Owin.dll".
         Copying file from "D:\temp\rfupqfga.0nq\input\packages\Newtonsoft.Json.6.0.4\lib\net45\Newtonsoft.Json.dll" to "D:\temp\rfupqfga.0nq\output\Newtonsoft.Json.dll".
         Copying file from "D:\temp\rfupqfga.0nq\input\packages\Microsoft.AspNet.WebApi.Client.5.2.3\lib\net45\System.Net.Http.Formatting.dll" to "D:\temp\rfupqfga.0nq\output\System.Net.Http.Formatting.dll".
         Copying file from "D:\temp\rfupqfga.0nq\input\packages\Microsoft.AspNet.WebPages.3.2.3\lib\net45\System.Web.Helpers.dll" to "D:\temp\rfupqfga.0nq\output\System.Web.Helpers.dll".
         Copying file from "D:\temp\rfupqfga.0nq\input\packages\Microsoft.AspNet.WebApi.Core.5.2.3\lib\net45\System.Web.Http.dll" to "D:\temp\rfupqfga.0nq\output\System.Web.Http.dll".
         Copying file from "D:\temp\rfupqfga.0nq\input\packages\Microsoft.AspNet.WebApi.WebHost.5.2.3\lib\net45\System.Web.Http.WebHost.dll" to "D:\temp\rfupqfga.0nq\output\System.Web.Http.WebHost.dll".
         Copying file from "D:\temp\rfupqfga.0nq\input\packages\Microsoft.AspNet.Mvc.5.2.3\lib\net45\System.Web.Mvc.dll" to "D:\temp\rfupqfga.0nq\output\System.Web.Mvc.dll".
         Copying file from "D:\temp\rfupqfga.0nq\input\packages\Microsoft.AspNet.Web.Optimization.1.1.3\lib\net40\System.Web.Optimization.dll" to "D:\temp\rfupqfga.0nq\output\System.Web.Optimization.dll".
         Copying file from "D:\temp\rfupqfga.0nq\input\packages\Microsoft.AspNet.Razor.3.2.3\lib\net45\System.Web.Razor.dll" to "D:\temp\rfupqfga.0nq\output\System.Web.Razor.dll".
         Copying file from "D:\temp\rfupqfga.0nq\input\packages\Microsoft.AspNet.WebPages.3.2.3\lib\net45\System.Web.WebPages.Deployment.dll" to "D:\temp\rfupqfga.0nq\output\System.Web.WebPages.Deployment.dll".
         Copying file from "D:\temp\rfupqfga.0nq\input\packages\Microsoft.AspNet.WebPages.3.2.3\lib\net45\System.Web.WebPages.Razor.dll" to "D:\temp\rfupqfga.0nq\output\System.Web.WebPages.Razor.dll".
         Copying file from "D:\temp\rfupqfga.0nq\input\packages\Microsoft.AspNet.WebPages.3.2.3\lib\net45\System.Web.WebPages.dll" to "D:\temp\rfupqfga.0nq\output\System.Web.WebPages.dll".
         Copying file from "D:\temp\rfupqfga.0nq\input\packages\WebGrease.1.5.2\lib\WebGrease.dll" to "D:\temp\rfupqfga.0nq\output\WebGrease.dll".
         Copying file from "D:\temp\rfupqfga.0nq\input\packages\Microsoft.AspNet.WebPages.3.2.3\lib\net45\System.Web.Helpers.xml" to "D:\temp\rfupqfga.0nq\output\System.Web.Helpers.xml".
         Copying file from "D:\temp\rfupqfga.0nq\input\packages\Antlr.3.4.1.9004\lib\Antlr3.Runtime.pdb" to "D:\temp\rfupqfga.0nq\output\Antlr3.Runtime.pdb".
         Copying file from "D:\temp\rfupqfga.0nq\input\packages\Microsoft.AspNet.Mvc.5.2.3\lib\net45\System.Web.Mvc.xml" to "D:\temp\rfupqfga.0nq\output\System.Web.Mvc.xml".
         Copying file from "D:\temp\rfupqfga.0nq\input\packages\Microsoft.AspNet.Web.Optimization.1.1.3\lib\net40\System.Web.Optimization.xml" to "D:\temp\rfupqfga.0nq\output\System.Web.Optimization.xml".
         Copying file from "D:\temp\rfupqfga.0nq\input\packages\Microsoft.AspNet.Razor.3.2.3\lib\net45\System.Web.Razor.xml" to "D:\temp\rfupqfga.0nq\output\System.Web.Razor.xml".
         Copying file from "D:\temp\rfupqfga.0nq\input\packages\Microsoft.AspNet.WebPages.3.2.3\lib\net45\System.Web.WebPages.xml" to "D:\temp\rfupqfga.0nq\output\System.Web.WebPages.xml".
         Copying file from "D:\temp\rfupqfga.0nq\input\packages\Microsoft.AspNet.WebPages.3.2.3\lib\net45\System.Web.WebPages.Razor.xml" to "D:\temp\rfupqfga.0nq\output\System.Web.WebPages.Razor.xml".
         Copying file from "D:\temp\rfupqfga.0nq\input\packages\Microsoft.AspNet.WebPages.3.2.3\lib\net45\System.Web.WebPages.Deployment.xml" to "D:\temp\rfupqfga.0nq\output\System.Web.WebPages.Deployment.xml".
         Copying file from "D:\temp\rfupqfga.0nq\input\packages\Newtonsoft.Json.6.0.4\lib\net45\Newtonsoft.Json.xml" to "D:\temp\rfupqfga.0nq\output\Newtonsoft.Json.xml".
         Copying file from "D:\temp\rfupqfga.0nq\input\packages\Microsoft.AspNet.WebApi.Core.5.2.3\lib\net45\System.Web.Http.xml" to "D:\temp\rfupqfga.0nq\output\System.Web.Http.xml".
         Copying file from "D:\temp\rfupqfga.0nq\input\packages\Microsoft.AspNet.WebApi.Client.5.2.3\lib\net45\System.Net.Http.Formatting.xml" to "D:\temp\rfupqfga.0nq\output\System.Net.Http.Formatting.xml".
         Copying file from "D:\temp\rfupqfga.0nq\input\packages\Microsoft.AspNet.WebApi.WebHost.5.2.3\lib\net45\System.Web.Http.WebHost.xml" to "D:\temp\rfupqfga.0nq\output\System.Web.Http.WebHost.xml".
         Creating "D:\temp\rfupqfga.0nq\input\PenYourPrayerServer\obj\Release\PenYourPrayerServer.csproj.CopyComplete" because "AlwaysCreate" was specified.
       _CopyAppConfigFile:
         Copying file from "Web.config" to "D:\temp\rfupqfga.0nq\output\PenYourPrayerServer.dll.config".
       CopyFilesToOutputDirectory:
         Copying file from "obj\Release\PenYourPrayerServer.dll" to "D:\temp\rfupqfga.0nq\output\PenYourPrayerServer.dll".
         PenYourPrayerServer -> D:\temp\rfupqfga.0nq\output\PenYourPrayerServer.dll
         Copying file from "obj\Release\PenYourPrayerServer.pdb" to "D:\temp\rfupqfga.0nq\output\PenYourPrayerServer.pdb".
       _CopyWebApplicationLegacy:
         Copying Web Application Project Files for PenYourPrayerServer
         Creating directory "D:\temp\rfupqfga.0nq\output\_PublishedWebsites\PenYourPrayerServer\bin".
         Copying file from "obj\Release\PenYourPrayerServer.dll" to "D:\temp\rfupqfga.0nq\output\_PublishedWebsites\PenYourPrayerServer\bin\PenYourPrayerServer.dll".
         Copying file from "obj\Release\PenYourPrayerServer.pdb" to "D:\temp\rfupqfga.0nq\output\_PublishedWebsites\PenYourPrayerServer\bin\PenYourPrayerServer.pdb".
         Copying file from "D:\temp\rfupqfga.0nq\input\PenYourPrayerServer\lib\EASendMail45.dll" to "D:\temp\rfupqfga.0nq\output\_PublishedWebsites\PenYourPrayerServer\bin\EASendMail45.dll".
         Copying file from "D:\temp\rfupqfga.0nq\input\packages\Microsoft.Web.Infrastructure.1.0.0.0\lib\net40\Microsoft.Web.Infrastructure.dll" to "D:\temp\rfupqfga.0nq\output\_PublishedWebsites\PenYourPrayerServer\bin\Microsoft.Web.Infrastructure.dll".
         Copying file from "D:\temp\rfupqfga.0nq\input\packages\Antlr.3.4.1.9004\lib\Antlr3.Runtime.dll" to "D:\temp\rfupqfga.0nq\output\_PublishedWebsites\PenYourPrayerServer\bin\Antlr3.Runtime.dll".
         Copying file from "D:\temp\rfupqfga.0nq\input\packages\Newtonsoft.Json.6.0.4\lib\net45\Newtonsoft.Json.dll" to "D:\temp\rfupqfga.0nq\output\_PublishedWebsites\PenYourPrayerServer\bin\Newtonsoft.Json.dll".
         Copying file from "D:\temp\rfupqfga.0nq\input\packages\Owin.1.0\lib\net40\Owin.dll" to "D:\temp\rfupqfga.0nq\output\_PublishedWebsites\PenYourPrayerServer\bin\Owin.dll".
         Copying file from "D:\temp\rfupqfga.0nq\input\packages\Microsoft.AspNet.WebApi.Client.5.2.3\lib\net45\System.Net.Http.Formatting.dll" to "D:\temp\rfupqfga.0nq\output\_PublishedWebsites\PenYourPrayerServer\bin\System.Net.Http.Formatting.dll".
         Copying file from "D:\temp\rfupqfga.0nq\input\packages\Microsoft.AspNet.WebPages.3.2.3\lib\net45\System.Web.Helpers.dll" to "D:\temp\rfupqfga.0nq\output\_PublishedWebsites\PenYourPrayerServer\bin\System.Web.Helpers.dll".
         Copying file from "D:\temp\rfupqfga.0nq\input\packages\Microsoft.AspNet.WebApi.Core.5.2.3\lib\net45\System.Web.Http.dll" to "D:\temp\rfupqfga.0nq\output\_PublishedWebsites\PenYourPrayerServer\bin\System.Web.Http.dll".
         Copying file from "D:\temp\rfupqfga.0nq\input\packages\Microsoft.AspNet.Mvc.5.2.3\lib\net45\System.Web.Mvc.dll" to "D:\temp\rfupqfga.0nq\output\_PublishedWebsites\PenYourPrayerServer\bin\System.Web.Mvc.dll".
         Copying file from "D:\temp\rfupqfga.0nq\input\packages\Microsoft.AspNet.WebApi.WebHost.5.2.3\lib\net45\System.Web.Http.WebHost.dll" to "D:\temp\rfupqfga.0nq\output\_PublishedWebsites\PenYourPrayerServer\bin\System.Web.Http.WebHost.dll".
         Copying file from "D:\temp\rfupqfga.0nq\input\packages\Microsoft.AspNet.Web.Optimization.1.1.3\lib\net40\System.Web.Optimization.dll" to "D:\temp\rfupqfga.0nq\output\_PublishedWebsites\PenYourPrayerServer\bin\System.Web.Optimization.dll".
         Copying file from "D:\temp\rfupqfga.0nq\input\packages\Microsoft.AspNet.Razor.3.2.3\lib\net45\System.Web.Razor.dll" to "D:\temp\rfupqfga.0nq\output\_PublishedWebsites\PenYourPrayerServer\bin\System.Web.Razor.dll".
         Copying file from "D:\temp\rfupqfga.0nq\input\packages\Microsoft.AspNet.WebPages.3.2.3\lib\net45\System.Web.WebPages.Deployment.dll" to "D:\temp\rfupqfga.0nq\output\_PublishedWebsites\PenYourPrayerServer\bin\System.Web.WebPages.Deployment.dll".
         Copying file from "D:\temp\rfupqfga.0nq\input\packages\Microsoft.AspNet.WebPages.3.2.3\lib\net45\System.Web.WebPages.dll" to "D:\temp\rfupqfga.0nq\output\_PublishedWebsites\PenYourPrayerServer\bin\System.Web.WebPages.dll".
         Copying file from "D:\temp\rfupqfga.0nq\input\packages\WebGrease.1.5.2\lib\WebGrease.dll" to "D:\temp\rfupqfga.0nq\output\_PublishedWebsites\PenYourPrayerServer\bin\WebGrease.dll".
         Copying file from "D:\temp\rfupqfga.0nq\input\packages\Microsoft.AspNet.WebPages.3.2.3\lib\net45\System.Web.WebPages.Razor.dll" to "D:\temp\rfupqfga.0nq\output\_PublishedWebsites\PenYourPrayerServer\bin\System.Web.WebPages.Razor.dll".
         Copying file from "D:\temp\rfupqfga.0nq\input\packages\Antlr.3.4.1.9004\lib\Antlr3.Runtime.pdb" to "D:\temp\rfupqfga.0nq\output\_PublishedWebsites\PenYourPrayerServer\bin\Antlr3.Runtime.pdb".
         Copying file from "D:\temp\rfupqfga.0nq\input\packages\Microsoft.AspNet.Mvc.5.2.3\lib\net45\System.Web.Mvc.xml" to "D:\temp\rfupqfga.0nq\output\_PublishedWebsites\PenYourPrayerServer\bin\System.Web.Mvc.xml".
         Copying file from "D:\temp\rfupqfga.0nq\input\packages\Microsoft.AspNet.WebPages.3.2.3\lib\net45\System.Web.Helpers.xml" to "D:\temp\rfupqfga.0nq\output\_PublishedWebsites\PenYourPrayerServer\bin\System.Web.Helpers.xml".
         Copying file from "D:\temp\rfupqfga.0nq\input\packages\Microsoft.AspNet.Web.Optimization.1.1.3\lib\net40\System.Web.Optimization.xml" to "D:\temp\rfupqfga.0nq\output\_PublishedWebsites\PenYourPrayerServer\bin\System.Web.Optimization.xml".
         Copying file from "D:\temp\rfupqfga.0nq\input\packages\Microsoft.AspNet.Razor.3.2.3\lib\net45\System.Web.Razor.xml" to "D:\temp\rfupqfga.0nq\output\_PublishedWebsites\PenYourPrayerServer\bin\System.Web.Razor.xml".
         Copying file from "D:\temp\rfupqfga.0nq\input\packages\Microsoft.AspNet.WebPages.3.2.3\lib\net45\System.Web.WebPages.xml" to "D:\temp\rfupqfga.0nq\output\_PublishedWebsites\PenYourPrayerServer\bin\System.Web.WebPages.xml".
         Copying file from "D:\temp\rfupqfga.0nq\input\packages\Microsoft.AspNet.WebPages.3.2.3\lib\net45\System.Web.WebPages.Deployment.xml" to "D:\temp\rfupqfga.0nq\output\_PublishedWebsites\PenYourPrayerServer\bin\System.Web.WebPages.Deployment.xml".
         Copying file from "D:\temp\rfupqfga.0nq\input\packages\Microsoft.AspNet.WebPages.3.2.3\lib\net45\System.Web.WebPages.Razor.xml" to "D:\temp\rfupqfga.0nq\output\_PublishedWebsites\PenYourPrayerServer\bin\System.Web.WebPages.Razor.xml".
         Copying file from "D:\temp\rfupqfga.0nq\input\packages\Newtonsoft.Json.6.0.4\lib\net45\Newtonsoft.Json.xml" to "D:\temp\rfupqfga.0nq\output\_PublishedWebsites\PenYourPrayerServer\bin\Newtonsoft.Json.xml".
         Copying file from "D:\temp\rfupqfga.0nq\input\packages\Microsoft.AspNet.WebApi.Client.5.2.3\lib\net45\System.Net.Http.Formatting.xml" to "D:\temp\rfupqfga.0nq\output\_PublishedWebsites\PenYourPrayerServer\bin\System.Net.Http.Formatting.xml".
         Copying file from "D:\temp\rfupqfga.0nq\input\packages\Microsoft.AspNet.WebApi.Core.5.2.3\lib\net45\System.Web.Http.xml" to "D:\temp\rfupqfga.0nq\output\_PublishedWebsites\PenYourPrayerServer\bin\System.Web.Http.xml".
         Copying file from "D:\temp\rfupqfga.0nq\input\packages\Microsoft.AspNet.WebApi.WebHost.5.2.3\lib\net45\System.Web.Http.WebHost.xml" to "D:\temp\rfupqfga.0nq\output\_PublishedWebsites\PenYourPrayerServer\bin\System.Web.Http.WebHost.xml".
         Creating directory "D:\temp\rfupqfga.0nq\output\_PublishedWebsites\PenYourPrayerServer\Content".
         Creating directory "D:\temp\rfupqfga.0nq\output\_PublishedWebsites\PenYourPrayerServer\Content".
         Copying file from "Content\Site.css" to "D:\temp\rfupqfga.0nq\output\_PublishedWebsites\PenYourPrayerServer\Content\\Site.css".
         Copying file from "Content\bootstrap.min.css" to "D:\temp\rfupqfga.0nq\output\_PublishedWebsites\PenYourPrayerServer\Content\\bootstrap.min.css".
         Copying file from "Content\bootstrap.css" to "D:\temp\rfupqfga.0nq\output\_PublishedWebsites\PenYourPrayerServer\Content\\bootstrap.css".
         Creating directory "D:\temp\rfupqfga.0nq\output\_PublishedWebsites\PenYourPrayerServer\fonts".
         Copying file from "fonts\glyphicons-halflings-regular.svg" to "D:\temp\rfupqfga.0nq\output\_PublishedWebsites\PenYourPrayerServer\fonts\\glyphicons-halflings-regular.svg".
         Copying file from "Global.asax" to "D:\temp\rfupqfga.0nq\output\_PublishedWebsites\PenYourPrayerServer\\Global.asax".
         Creating directory "D:\temp\rfupqfga.0nq\output\_PublishedWebsites\PenYourPrayerServer\Scripts".
         Creating directory "D:\temp\rfupqfga.0nq\output\_PublishedWebsites\PenYourPrayerServer\Scripts".
         Creating directory "D:\temp\rfupqfga.0nq\output\_PublishedWebsites\PenYourPrayerServer\Scripts".
         Copying file from "Scripts\bootstrap.js" to "D:\temp\rfupqfga.0nq\output\_PublishedWebsites\PenYourPrayerServer\Scripts\\bootstrap.js".
         Copying file from "Scripts\jquery-1.10.2.js" to "D:\temp\rfupqfga.0nq\output\_PublishedWebsites\PenYourPrayerServer\Scripts\\jquery-1.10.2.js".
         Copying file from "Scripts\bootstrap.min.js" to "D:\temp\rfupqfga.0nq\output\_PublishedWebsites\PenYourPrayerServer\Scripts\\bootstrap.min.js".
         Copying file from "Scripts\jquery.validate.js" to "D:\temp\rfupqfga.0nq\output\_PublishedWebsites\PenYourPrayerServer\Scripts\\jquery.validate.js".
         Copying file from "Scripts\jquery-1.10.2.min.js" to "D:\temp\rfupqfga.0nq\output\_PublishedWebsites\PenYourPrayerServer\Scripts\\jquery-1.10.2.min.js".
         Copying file from "Scripts\jquery.validate.min.js" to "D:\temp\rfupqfga.0nq\output\_PublishedWebsites\PenYourPrayerServer\Scripts\\jquery.validate.min.js".
         Copying file from "Scripts\jquery.validate.unobtrusive.js" to "D:\temp\rfupqfga.0nq\output\_PublishedWebsites\PenYourPrayerServer\Scripts\\jquery.validate.unobtrusive.js".
         Copying file from "Scripts\jquery.validate.unobtrusive.min.js" to "D:\temp\rfupqfga.0nq\output\_PublishedWebsites\PenYourPrayerServer\Scripts\\jquery.validate.unobtrusive.min.js".
         Copying file from "Scripts\modernizr-2.6.2.js" to "D:\temp\rfupqfga.0nq\output\_PublishedWebsites\PenYourPrayerServer\Scripts\\modernizr-2.6.2.js".
         Creating directory "D:\temp\rfupqfga.0nq\output\_PublishedWebsites\PenYourPrayerServer\Views\Home".
         Copying file from "Views\Home\index.aspx" to "D:\temp\rfupqfga.0nq\output\_PublishedWebsites\PenYourPrayerServer\Views\Home\\index.aspx".
         Copying file from "Web.config" to "D:\temp\rfupqfga.0nq\output\_PublishedWebsites\PenYourPrayerServer\\Web.config".
         Copying file from "packages.config" to "D:\temp\rfupqfga.0nq\output\_PublishedWebsites\PenYourPrayerServer\\packages.config".
         Creating directory "D:\temp\rfupqfga.0nq\output\_PublishedWebsites\PenYourPrayerServer\Models".
         Copying file from "fonts\glyphicons-halflings-regular.woff" to "D:\temp\rfupqfga.0nq\output\_PublishedWebsites\PenYourPrayerServer\fonts\\glyphicons-halflings-regular.woff".
         Copying file from "fonts\glyphicons-halflings-regular.ttf" to "D:\temp\rfupqfga.0nq\output\_PublishedWebsites\PenYourPrayerServer\fonts\\glyphicons-halflings-regular.ttf".
         Copying file from "fonts\glyphicons-halflings-regular.eot" to "D:\temp\rfupqfga.0nq\output\_PublishedWebsites\PenYourPrayerServer\fonts\\glyphicons-halflings-regular.eot".
         Creating directory "D:\temp\rfupqfga.0nq\output\_PublishedWebsites\PenYourPrayerServer\Views\Shared".
         Copying file from "Views\Shared\Error.cshtml" to "D:\temp\rfupqfga.0nq\output\_PublishedWebsites\PenYourPrayerServer\Views\Shared\\Error.cshtml".
         Copying file from "Views\_ViewStart.cshtml" to "D:\temp\rfupqfga.0nq\output\_PublishedWebsites\PenYourPrayerServer\Views\\_ViewStart.cshtml".
         Copying file from "Views\Shared\_Layout.cshtml" to "D:\temp\rfupqfga.0nq\output\_PublishedWebsites\PenYourPrayerServer\Views\Shared\\_Layout.cshtml".
         Copying file from "Views\web.config" to "D:\temp\rfupqfga.0nq\output\_PublishedWebsites\PenYourPrayerServer\Views\\web.config".
         Copying file from "Scripts\jquery-1.10.2.min.map" to "D:\temp\rfupqfga.0nq\output\_PublishedWebsites\PenYourPrayerServer\Scripts\\jquery-1.10.2.min.map".
         Copying file from "Models\DB.dbml" to "D:\temp\rfupqfga.0nq\output\_PublishedWebsites\PenYourPrayerServer\Models\\DB.dbml".
     2>Done Building Project "D:\temp\rfupqfga.0nq\input\PenYourPrayerServer\PenYourPrayerServer.csproj" (default targets).
     1>Done Building Project "D:\temp\rfupqfga.0nq\input\PenYourPrayerServer.sln" (default targets) -- FAILED.

Build FAILED.

       "D:\temp\rfupqfga.0nq\input\PenYourPrayerServer.sln" (default target) (1) ->
       "D:\temp\rfupqfga.0nq\input\PenYourPrayerServer\PenYourPrayerServer.csproj" (default target) (2) ->
       (CoreCompile target) ->
         Supporting\SocialMediaAuthentication.cs(59,34): warning CS0168: The variable 'e' is declared but never used [D:\temp\rfupqfga.0nq\input\PenYourPrayerServer\PenYourPrayerServer.csproj]
         Supporting\SocialMediaAuthentication.cs(77,30): warning CS0168: The variable 'e' is declared but never used [D:\temp\rfupqfga.0nq\input\PenYourPrayerServer\PenYourPrayerServer.csproj]
         Supporting\SocialMediaAuthentication.cs(152,30): warning CS0168: The variable 'ex' is declared but never used [D:\temp\rfupqfga.0nq\input\PenYourPrayerServer\PenYourPrayerServer.csproj]
         Supporting\HMAC\HMACAuthorizeAttribute.cs(59,17): warning CS0162: Unreachable code detected [D:\temp\rfupqfga.0nq\input\PenYourPrayerServer\PenYourPrayerServer.csproj]
         Supporting\HMAC\HMACAuthorizeAttribute.cs(206,34): warning CS0168: The variable 'e' is declared but never used [D:\temp\rfupqfga.0nq\input\PenYourPrayerServer\PenYourPrayerServer.csproj]
         Controllers\UserAccountController.cs(66,17): warning CS4014: Because this call is not awaited, execution of the current method continues before the call is completed. Consider applying the 'await' operator to the result of the call. [D:\temp\rfupqfga.0nq\input\PenYourPrayerServer\PenYourPrayerServer.csproj]
         Controllers\UserAccountController.cs(80,21): warning CS4014: Because this call is not awaited, execution of the current method continues before the call is completed. Consider applying the 'await' operator to the result of the call. [D:\temp\rfupqfga.0nq\input\PenYourPrayerServer\PenYourPrayerServer.csproj]
         Controllers\UserAccountController.cs(103,21): warning CS4014: Because this call is not awaited, execution of the current method continues before the call is completed. Consider applying the 'await' operator to the result of the call. [D:\temp\rfupqfga.0nq\input\PenYourPrayerServer\PenYourPrayerServer.csproj]
         Controllers\PrayerController.cs(83,24): warning CS0219: The variable 'res' is assigned but its value is never used [D:\temp\rfupqfga.0nq\input\PenYourPrayerServer\PenYourPrayerServer.csproj]
         Controllers\PrayerController.cs(160,24): warning CS0219: The variable 'res' is assigned but its value is never used [D:\temp\rfupqfga.0nq\input\PenYourPrayerServer\PenYourPrayerServer.csproj]
         Controllers\AccountController.cs(23,13): warning CS0162: Unreachable code detected [D:\temp\rfupqfga.0nq\input\PenYourPrayerServer\PenYourPrayerServer.csproj]
         Controllers\PrayerController.cs(236,24): warning CS0219: The variable 'res' is assigned but its value is never used [D:\temp\rfupqfga.0nq\input\PenYourPrayerServer\PenYourPrayerServer.csproj]
         Controllers\PrayerController.cs(313,24): warning CS0219: The variable 'res' is assigned but its value is never used [D:\temp\rfupqfga.0nq\input\PenYourPrayerServer\PenYourPrayerServer.csproj]
         Controllers\PrayerController.cs(390,24): warning CS0219: The variable 'res' is assigned but its value is never used [D:\temp\rfupqfga.0nq\input\PenYourPrayerServer\PenYourPrayerServer.csproj]
         Controllers\PrayerController.cs(539,34): warning CS0168: The variable 'e' is declared but never used [D:\temp\rfupqfga.0nq\input\PenYourPrayerServer\PenYourPrayerServer.csproj]
         Controllers\PrayerController.cs(588,34): warning CS0168: The variable 'e' is declared but never used [D:\temp\rfupqfga.0nq\input\PenYourPrayerServer\PenYourPrayerServer.csproj]
         Controllers\PrayerController.cs(627,23): warning CS0219: The variable 'AmenID' is assigned but its value is never used [D:\temp\rfupqfga.0nq\input\PenYourPrayerServer\PenYourPrayerServer.csproj]
         Controllers\PrayerController.cs(628,24): warning CS0219: The variable 'res' is assigned but its value is never used [D:\temp\rfupqfga.0nq\input\PenYourPrayerServer\PenYourPrayerServer.csproj]
         Controllers\PrayerController.cs(676,34): warning CS0168: The variable 'e' is declared but never used [D:\temp\rfupqfga.0nq\input\PenYourPrayerServer\PenYourPrayerServer.csproj]
         Controllers\PrayerController.cs(807,34): warning CS0168: The variable 'e' is declared but never used [D:\temp\rfupqfga.0nq\input\PenYourPrayerServer\PenYourPrayerServer.csproj]
         Models\Struct\PrayerRequest.cs(35,17): warning CS0472: The result of the expression is always 'true' since a value of type 'long' is never equal to 'null' of type 'long?' [D:\temp\rfupqfga.0nq\input\PenYourPrayerServer\PenYourPrayerServer.csproj]

    21 Warning(s)
    0 Error(s)

Time Elapsed 00:00:01.28

  1. Support Staff 1 Posted by rune on 24 Dec, 2018 11:08 AM

    rune's Avatar

    Hi,

    It looks like the Database1\Database1.sqlproj project is causing the build failure. While I'm not sure exactly why I'm curious why this project is included in the solution in the first place? Is this used primarily during development, and is it possible that it's not necessary to build on AppHarbor when releasing new versions of your code? If so you might be able to just exclude the project when built for release and avoid the problem altogether.

    Best,
    Rune

Discussions are closed to public comments.
If you need help with AppHarbor please start a new discussion.

Keyboard shortcuts

Generic

? Show this help
ESC Blurs the current field

Comment Form

r Focus the comment reply box
^ + ↩ Submit the comment

You can use Command ⌘ instead of Control ^ on Mac