Build Error MSB3202: The project file ".csproj" was not found. Complete log in the description.

rrlangomes's Avatar

rrlangomes

19 Sep, 2017 10:16 AM

Build started 9/19/2017 10:09:15 AM.
     1>Project "D:\temp\dvkc0ec2.zrt\input\LoginAPI1.sln" on node 1 (default targets).
     1>ValidateSolutionConfiguration:
         Building solution configuration "Release|Any CPU".
     1>D:\temp\dvkc0ec2.zrt\input\LoginAPI1.sln.metaproj : error MSB3202: The project file "D:\temp\dvkc0ec2.zrt\input\LoginAPI1\LoginAPI1.csproj" was not found. [D:\temp\dvkc0ec2.zrt\input\LoginAPI1.sln]
     1>Done Building Project "D:\temp\dvkc0ec2.zrt\input\LoginAPI1.sln" (default targets) -- FAILED.

Build FAILED.

       "D:\temp\dvkc0ec2.zrt\input\LoginAPI1.sln" (default target) (1) ->
       (Build target) ->
         D:\temp\dvkc0ec2.zrt\input\LoginAPI1.sln.metaproj : error MSB3202: The project file "D:\temp\dvkc0ec2.zrt\input\LoginAPI1\LoginAPI1.csproj" was not found. [D:\temp\dvkc0ec2.zrt\input\LoginAPI1.sln]

    0 Warning(s)
    1 Error(s)

Time Elapsed 00:00:00.10

  1. Support Staff 1 Posted by rune on 26 Sep, 2017 04:22 AM

    rune's Avatar

    Hi,

    It seems like the referenced hasn't been checked in to your repository - the folder LoginAPI1 exists but no files have been committed. Try and add these files to your repository and push again :)

    Best,
    Rune

  2. rune closed this discussion on 26 Sep, 2017 04:22 AM.

Comments are currently closed for this discussion. You can start a new one.

Keyboard shortcuts

Generic

? Show this help
ESC Blurs the current field

Comment Form

r Focus the comment reply box
^ + ↩ Submit the comment

You can use Command ⌘ instead of Control ^ on Mac